Reaction Details
TargetALK tyrosine kinase receptor
LigandBDBM50300196
Substrate/Competitorn/a
Meas. Tech.ChEMBL_592724 (CHEMBL1042395)
Ki 1.7E1±n/a nM
Citation Wang, TDuffy, JPWang, JHalas, SSalituro, FGPierce, ACZuccola, HJBlack, JRHogan, JKJepson, SShlyakter, DMahajan, SGu, YHoock, TWood, MFurey, BFFrantz, JDDauffenbach, LMGermann, UAFan, BNamchuk, MBennani, YLLedeboer, MW Janus kinase 2 inhibitors. Synthesis and characterization of a novel polycyclic azaindole. J Med Chem52:7938-41 (2009) 
 
ALK tyrosine kinase receptor
Name:ALK tyrosine kinase receptor
Type:Protein
Mol. Mass.:176453.10
Organism:Homo sapiens (Human)
Description:Q9UM73
Residue:1620
BDBM50300196
NameBDBM50300196
Synonyms:10-(4-hydroxyphenyl)-8,13,15-triazatetracyclo[9.6.1.0^{2,7}.0^{14,18}]octadeca-1(18),2(7),3,5,11,14,16-heptaen-9-one atropisomer 1 | atropisomer 2
TypeSmall organic molecule
Emp. Form.C21H15N3O2
Mol. Mass.341.3627
SMILESOc1ccc(cc1)C1c2c[nH]c3nccc(-c4ccccc4NC1=O)c23