Reaction Details
TargetMonoglyceride lipase
LigandBDBM60622
Substrate/Competitorn/a
Meas. Tech.ChEMBL_590919 (CHEMBL1045637)
IC50 6±n/a nM
Citation Matuszak, NMuccioli, GGLabar, GLambert, DM Synthesis and in vitro evaluation of N-substituted maleimide derivatives as selective monoglyceride lipase inhibitors. J Med Chem52:7410-20 (2009) 
 
Monoglyceride lipase
Name:Monoglyceride lipase
Type:Hydrolase
Mol. Mass.:33264.56
Organism:Homo sapiens (Human)
Description:Human recombinant MGL (Cayman Chemical, cat# 10008354).
Residue:303
BDBM60622
NameBDBM60622
Synonyms:BDBM50300355 US9133148, A
Typen/a
Emp. Form.C27H24N2O9
Mol. Mass.520.4875
SMILESOC(C1CCN(CC1)C(=O)Oc1ccc(cc1)[N+]([O-])=O)(c1ccc2OCOc2c1)c1ccc2OCOc2c1