Reaction Details
TargetMu-type opioid receptor
LigandBDBM50300356
Substrate/Competitorn/a
Meas. Tech.ChEMBL_591212 (CHEMBL1058518)
IC50 0.810000±n/a nM
Citation Sinha, BCao, ZMurray, TFAldrich, JV Discovery of dermorphin-based affinity labels with subnanomolar affinity for mu opioid receptors. J Med Chem52:7372-5 (2009) 
 
Mu-type opioid receptor
Name:Mu-type opioid receptor
Type:G Protein-Coupled Receptor (GPCR)
Mol. Mass.:44789.51
Organism:Homo sapiens (Human)
Description:P35372
Residue:400
BDBM50300356
NameBDBM50300356
Synonyms:(S)-2-((S)-1-((2S,8S,11R,14S)-14-amino-8-benzyl-11-(3-(diisothiocyanatoamino)propyl)-2-(4-hydroxybenzyl)-15-(4-hydroxyphenyl)-4,7,10,13-tetraoxo-3,6,9,12-tetraazapentadecane)pyrrolidine-2-carboxamido)-3-hydroxypropanoic acid | CHEMBL584993
TypeSmall organic molecule
Emp. Form.C44H52N10O11S2
Mol. Mass.961.074
SMILESN[C@@H](Cc1ccc(O)cc1)C(=O)N[C@H](CCCN(N=C=S)N=C=S)C(=O)N[C@@H](Cc1ccccc1)C(=O)NCC(=O)N[C@@H](Cc1ccc(O)cc1)C(=O)N1CCC[C@H]1C(=O)N[C@@H](CO)C(O)=O