Reaction Details
TargetMu-type opioid receptor
LigandBDBM50247803
Substrate/Competitorn/a
Meas. Tech.ChEMBL_591225 (CHEMBL1059303)
IC50 2.2±n/a nM
Citation Sinha, BCao, ZMurray, TFAldrich, JV Discovery of dermorphin-based affinity labels with subnanomolar affinity for mu opioid receptors. J Med Chem52:7372-5 (2009) 
 
Mu-type opioid receptor
Name:Mu-type opioid receptor
Type:Enzyme Catalytic Domain
Mol. Mass.:11165.58
Organism:GUINEA PIG
Description:P97266
Residue:98
BDBM50247803
NameBDBM50247803
Synonyms:Beta-Funeltrexamine beta-funaltrexamine methyl 3-[4-cyclopropylmethyl-10,17-dihydroxy-12-oxa-4-azapentacyclo[9.6.1.01,13.05,17.07,18]octadeca-7(18),8,10-trien-14-ylcarbamoyl]-(E)-2-propenoate
TypeSmall organic molecule
Emp. Form.C25H30N2O6
Mol. Mass.454.5155
SMILESCOC(=O)\C=C\C(=O)N[C@@H]1CC[C@@]2(O)[C@H]3Cc4ccc(O)c5O[C@@H]1[C@]2(CCN3CC1CC1)c45