Reaction Details
TargetMu-type opioid receptor
LigandBDBM50300370
Substrate/Competitorn/a
Meas. Tech.ChEMBL_591227 (CHEMBL1056132)
Ki 48±n/a nM
Citation Zhang, YLee, YSRothman, RBDersch, CMDeschamps, JRJacobson, AERice, KC Probes for narcotic receptor mediated phenomena. 39. Enantiomeric N-substituted benzofuro[2,3-c]pyridin-6-ols: synthesis and topological relationship to oxide-bridged phenylmorphans. J Med Chem52:7570-9 (2009) 
 
Mu-type opioid receptor
Name:Mu-type opioid receptor
Type:G Protein-Coupled Receptor (GPCR)
Mol. Mass.:44789.51
Organism:Homo sapiens (Human)
Description:P35372
Residue:400
BDBM50300370
NameBDBM50300370
Synonyms:4aS,9aR-(-)-cis-4a-Ethyl-1,2,3,4,4a,9a-hexahydrobenzofuro-[2,3-c]pyridin-6-ol | CHEMBL567855
TypeSmall organic molecule
Emp. Form.C13H17NO2
Mol. Mass.219.2796
SMILESCC[C@@]12CCNC[C@@H]1Oc1ccc(O)cc21