Reaction Details
TargetKappa-type opioid receptor
LigandBDBM50300368
Substrate/Competitorn/a
Meas. Tech.ChEMBL_591229 (CHEMBL1056134)
Ki 1090±n/a nM
Citation Zhang, YLee, YSRothman, RBDersch, CMDeschamps, JRJacobson, AERice, KC Probes for narcotic receptor mediated phenomena. 39. Enantiomeric N-substituted benzofuro[2,3-c]pyridin-6-ols: synthesis and topological relationship to oxide-bridged phenylmorphans. J Med Chem52:7570-9 (2009) 
 
Kappa-type opioid receptor
Name:Kappa-type opioid receptor
Type:G Protein-Coupled Receptor (GPCR)
Mol. Mass.:42648.76
Organism:Homo sapiens (Human)
Description:P41145
Residue:380
BDBM50300368
NameBDBM50300368
Synonyms:4aS,9aR,2'R-(-)-cis-2-(2'-Hydroxy-2-phenylethyl)-4a-ethyl-1,2,3,4,4a,9a-hexahydrobenzofuro[2,3-c]pyridin-6-ol | CHEMBL566527
TypeSmall organic molecule
Emp. Form.C21H25NO3
Mol. Mass.339.4281
SMILESCC[C@@]12CCN(C[C@H](O)c3ccccc3)C[C@@H]1Oc1ccc(O)cc21