Reaction Details
TargetKappa-type opioid receptor
LigandBDBM50300380
Substrate/Competitorn/a
Meas. Tech.ChEMBL_591244 (CHEMBL1056149)
EC50 1.6±n/a nM
Citation Decker, MFulton, BSZhang, BKnapp, BIBidlack, JMNeumeyer, JL Univalent and bivalent ligands of butorphan: characteristics of the linking chain determine the affinity and potency of such opioid ligands. J Med Chem52:7389-96 (2009) 
 
Kappa-type opioid receptor
Name:Kappa-type opioid receptor
Type:G Protein-Coupled Receptor (GPCR)
Mol. Mass.:42648.76
Organism:Homo sapiens (Human)
Description:P41145
Residue:380
BDBM50300380
NameBDBM50300380
Synonyms:(1R,10R)-17-(cyclobutylmethyl)-17-azatetracyclo[7.5.3.0^{1,10}.0^{2,7}]heptadeca-2,4,6-trien-4-yl (1S,5R,13S,17R)-4-(prop-2-en-1-yl)-12-oxa-4-azapentacyclo[9.6.1.0^{1,13}.0^{5,17}.0^{7,18}]octadeca-7,9,11(18)-trien-10-yl decanedioate | CHEMBL584791
TypeSmall organic molecule
Emp. Form.C50H66N2O5
Mol. Mass.775.0694
SMILESC=CCN1CC[C@]23[C@@H]4CCC[C@H]2[C@H]1Cc1ccc(OC(=O)CCCCCCCCC(=O)Oc2ccc5CC6[C@@H]7CCCC[C@]7(CCN6CC6CCC6)c5c2)c(O4)c31