Reaction Details
TargetKappa-type opioid receptor
LigandBDBM50300373
Substrate/Competitorn/a
Meas. Tech.ChEMBL_591244 (CHEMBL1056149)
Ki 0.420000±n/a nM
Citation Decker, MFulton, BSZhang, BKnapp, BIBidlack, JMNeumeyer, JL Univalent and bivalent ligands of butorphan: characteristics of the linking chain determine the affinity and potency of such opioid ligands. J Med Chem52:7389-96 (2009) 
 
Kappa-type opioid receptor
Name:Kappa-type opioid receptor
Type:G Protein-Coupled Receptor (GPCR)
Mol. Mass.:42648.76
Organism:Homo sapiens (Human)
Description:P41145
Residue:380
BDBM50300373
NameBDBM50300373
Synonyms:2,9-Dimethyldecanedioic Acid 10-((-)-N-Cyclobutylmethylmorphinan-3-yl)Ester | CHEMBL565679
TypeSmall organic molecule
Emp. Form.C33H49NO4
Mol. Mass.523.7465
SMILESCC(CCCCCCC(C)C(=O)Oc1ccc2C[C@@H]3[C@@H]4CCCC[C@]4(CCN3CC3CCC3)c2c1)C(O)=O