Reaction Details
TargetMu-type opioid receptor
LigandBDBM50135808
Substrate/Competitorn/a
Meas. Tech.ChEMBL_591242 (CHEMBL1056147)
IC50 20±n/a nM
Citation Decker, MFulton, BSZhang, BKnapp, BIBidlack, JMNeumeyer, JL Univalent and bivalent ligands of butorphan: characteristics of the linking chain determine the affinity and potency of such opioid ligands. J Med Chem52:7389-96 (2009) 
 
Mu-type opioid receptor
Name:Mu-type opioid receptor
Type:G Protein-Coupled Receptor (GPCR)
Mol. Mass.:44789.51
Organism:Homo sapiens (Human)
Description:P35372
Residue:400
BDBM50135808
NameBDBM50135808
Synonyms:(-)-3-Hydroxy-N-cyclobutylmethylmorphinan S(+)-Mandelate 3-Hydroxy-N-cyclobutylmethylmorphinan CHEMBL301160 | MCL-101
TypeSmall organic molecule
Emp. Form.C21H29NO
Mol. Mass.311.4611
SMILESOc1ccc2C[C@@H]3[C@@H]4CCCC[C@]4(CCN3CC3CCC3)c2c1