Reaction Details
TargetTyrosine-protein kinase ZAP-70
LigandBDBM50300401
Substrate/Competitorn/a
Meas. Tech.ChEMBL_591751 (CHEMBL1037893)
IC50 10±n/a nM
Citation Sanam, RVadivelan, STajne, SNarasu, LRambabu, GJagarlapudi, SA Discovery of potential ZAP-70 kinase inhibitors: pharmacophore design, database screening and docking studies. Eur J Med Chem44:4793-800 (2009) 
 
Tyrosine-protein kinase ZAP-70
Name:Tyrosine-protein kinase ZAP-70
Type:Enzyme
Mol. Mass.:69881.61
Organism:Homo sapiens (Human)
Description:ZAP-70 SH2 domain was expressed and purified from E. coli using O-phospho-L-tyrosine-agarose column.
Residue:619
BDBM50300401
NameBDBM50300401
Synonyms:2-(5-bromo-2-(2,3-dihydro-1H-inden-4-ylamino)pyrimidin-4-ylamino)-N-methylbenzenesulfonamide | CHEMBL575048
TypeSmall organic molecule
Emp. Form.C20H20BrN5O2S
Mol. Mass.474.374
SMILESCNS(=O)(=O)c1ccccc1Nc1nc(Nc2cccc3CCCc23)ncc1Br