Reaction Details
TargetDelta-type opioid receptor
LigandBDBM50300442
Substrate/Competitorn/a
Meas. Tech.ChEMBL_591965 (CHEMBL1047528)
Ki 5.1±n/a nM
Citation Marton, JSchoultz, BWHjørnevik, TDrzezga, AYousefi, BHWester, HJWilloch, FHenriksen, G Synthesis and evaluation of a full-agonist orvinol for PET-imaging of opioid receptors: [11C]PEO. J Med Chem52:5586-9 (2009) 
 
Delta-type opioid receptor
Name:Delta-type opioid receptor
Type:G Protein-Coupled Receptor (GPCR)
Mol. Mass.:40382.98
Organism:Homo sapiens (Human)
Description:Competition binding assays were carried out using membrane preparations from transfected HN9.10 cells that constitutively expressed the delta opioid receptor.
Residue:372
BDBM50300442
NameBDBM50300442
Synonyms:(20R)-4,5-alpha-Epoxy-17-methyl-3-hydroxy-6-methoxy-alpha-17-dimethyl-alpha-(2-phenylethyl)-6,14-ethenomorphinan-7-methanol | CHEMBL578629
TypeSmall organic molecule
Emp. Form.C30H35NO4
Mol. Mass.473.6032
SMILESCO[C@]12C=C[C@@]3(C[C@@H]1[C@@](C)(O)CCc1ccccc1)[C@H]1Cc4ccc(O)c5O[C@@H]2[C@]3(CCN1C)c45