Reaction Details
TargetHistone deacetylase 5
LigandBDBM50300452
Substrate/Competitorn/a
Meas. Tech.ChEMBL_592000 (CHEMBL1050115)
IC50 210±n/a nM
Citation Tessier, PSmil, DVWahhab, ALeit, SRahil, JLi, ZDéziel, RBesterman, JM Diphenylmethylene hydroxamic acids as selective class IIa histone deacetylase inhibitors. Bioorg Med Chem Lett19:5684-8 (2009) 
 
Histone deacetylase 5
Name:Histone deacetylase 5
Type:Enzyme
Mol. Mass.:121968.61
Organism:Homo sapiens (Human)
Description:Q9UQL6
Residue:1122
BDBM50300452
NameBDBM50300452
Synonyms:2,2-bis(4-chlorophenyl)-N-hydroxyacetamide | CHEMBL572805
TypeSmall organic molecule
Emp. Form.C14H11Cl2NO2
Mol. Mass.296.149
SMILESONC(=O)C(c1ccc(Cl)cc1)c1ccc(Cl)cc1