Reaction Details
TargetHistone deacetylase 5
LigandBDBM50300443
Substrate/Competitorn/a
Meas. Tech.ChEMBL_592000 (CHEMBL1050115)
IC50 90±n/a nM
Citation Tessier, PSmil, DVWahhab, ALeit, SRahil, JLi, ZDéziel, RBesterman, JM Diphenylmethylene hydroxamic acids as selective class IIa histone deacetylase inhibitors. Bioorg Med Chem Lett19:5684-8 (2009) 
 
Histone deacetylase 5
Name:Histone deacetylase 5
Type:Enzyme
Mol. Mass.:121968.61
Organism:Homo sapiens (Human)
Description:Q9UQL6
Residue:1122
BDBM50300443
NameBDBM50300443
Synonyms:2,2-bis(3-fluorophenyl)-N-hydroxyacetamide | CHEMBL574594
TypeSmall organic molecule
Emp. Form.C14H11F2NO2
Mol. Mass.263.2394
SMILESONC(=O)C(c1cccc(F)c1)c1cccc(F)c1