Reaction Details
TargetHistone deacetylase 5
LigandBDBM50300453
Substrate/Competitorn/a
Meas. Tech.ChEMBL_592000 (CHEMBL1050115)
IC50 110±n/a nM
Citation Tessier, PSmil, DVWahhab, ALeit, SRahil, JLi, ZDéziel, RBesterman, JM Diphenylmethylene hydroxamic acids as selective class IIa histone deacetylase inhibitors. Bioorg Med Chem Lett19:5684-8 (2009) 
 
Histone deacetylase 5
Name:Histone deacetylase 5
Type:Enzyme
Mol. Mass.:121968.61
Organism:Homo sapiens (Human)
Description:Q9UQL6
Residue:1122
BDBM50300453
NameBDBM50300453
Synonyms:2,2-bis(2,3-dihydrobenzofuran-5-yl)-N-hydroxyacetamide | CHEMBL583967
TypeSmall organic molecule
Emp. Form.C18H17NO4
Mol. Mass.311.3319
SMILESONC(=O)C(c1ccc2OCCc2c1)c1ccc2OCCc2c1