Reaction Details
TargetHistone deacetylase 7
LigandBDBM50300450
Substrate/Competitorn/a
Meas. Tech.ChEMBL_592001 (CHEMBL1050116)
IC50>10000±n/a nM
Citation Tessier, PSmil, DVWahhab, ALeit, SRahil, JLi, ZDéziel, RBesterman, JM Diphenylmethylene hydroxamic acids as selective class IIa histone deacetylase inhibitors. Bioorg Med Chem Lett19:5684-8 (2009) 
 
Histone deacetylase 7
Name:Histone deacetylase 7
Type:Chromatin regulator; hydrolase; repressor
Mol. Mass.:102942.62
Organism:Homo sapiens (Human)
Description:Q8WUI4
Residue:952
BDBM50300450
NameBDBM50300450
Synonyms:CHEMBL575258 | N-hydroxy-2,3-diphenylpropanamide
TypeSmall organic molecule
Emp. Form.C15H15NO2
Mol. Mass.241.2851
SMILESONC(=O)C(Cc1ccccc1)c1ccccc1