Reaction Details
TargetHistone deacetylase 7
LigandBDBM50300454
Substrate/Competitorn/a
Meas. Tech.ChEMBL_592001 (CHEMBL1050116)
IC50>10000±n/a nM
Citation Tessier, PSmil, DVWahhab, ALeit, SRahil, JLi, ZDéziel, RBesterman, JM Diphenylmethylene hydroxamic acids as selective class IIa histone deacetylase inhibitors. Bioorg Med Chem Lett19:5684-8 (2009) 
 
Histone deacetylase 7
Name:Histone deacetylase 7
Type:Chromatin regulator; hydrolase; repressor
Mol. Mass.:102942.62
Organism:Homo sapiens (Human)
Description:Q8WUI4
Residue:952
BDBM50300454
NameBDBM50300454
Synonyms:CHEMBL574378 | N-hydroxy-2,2-bis(4-(methylsulfonamido)phenyl)acetamide
TypeSmall organic molecule
Emp. Form.C16H19N3O6S2
Mol. Mass.413.469
SMILESCS(=O)(=O)Nc1ccc(cc1)C(C(=O)NO)c1ccc(NS(C)(=O)=O)cc1