Reaction Details
TargetHistone deacetylase 4
LigandBDBM50300446
Substrate/Competitorn/a
Meas. Tech.ChEMBL_591999 (CHEMBL1050114)
IC50 250±n/a nM
Citation Tessier, PSmil, DVWahhab, ALeit, SRahil, JLi, ZDéziel, RBesterman, JM Diphenylmethylene hydroxamic acids as selective class IIa histone deacetylase inhibitors. Bioorg Med Chem Lett19:5684-8 (2009) 
 
Histone deacetylase 4
Name:Histone deacetylase 4
Type:Enzyme
Mol. Mass.:119049.39
Organism:Homo sapiens (Human)
Description:P56524
Residue:1084
BDBM50300446
NameBDBM50300446
Synonyms:CHEMBL583490 | N-hydroxy-9H-xanthene-9-carboxamide
TypeSmall organic molecule
Emp. Form.C14H11NO3
Mol. Mass.241.242
SMILESONC(=O)C1c2ccccc2Oc2ccccc12