Reaction Details
TargetHistone deacetylase 4
LigandBDBM50207561
Substrate/Competitorn/a
Meas. Tech.ChEMBL_591999 (CHEMBL1050114)
IC50 750±n/a nM
Citation Tessier, PSmil, DVWahhab, ALeit, SRahil, JLi, ZDéziel, RBesterman, JM Diphenylmethylene hydroxamic acids as selective class IIa histone deacetylase inhibitors. Bioorg Med Chem Lett19:5684-8 (2009) 
 
Histone deacetylase 4
Name:Histone deacetylase 4
Type:Enzyme
Mol. Mass.:119049.39
Organism:Homo sapiens (Human)
Description:P56524
Residue:1084
BDBM50207561
NameBDBM50207561
Synonyms:CHEMBL396097 N-hydroxy-2,2-diphenylacetamide
TypeSmall organic molecule
Emp. Form.C14H13NO2
Mol. Mass.227.2585
SMILESONC(=O)C(c1ccccc1)c1ccccc1