Reaction Details
TargetHistone deacetylase 7
LigandBDBM50300452
Substrate/Competitorn/a
Meas. Tech.ChEMBL_592001 (CHEMBL1050116)
IC50 1400±n/a nM
Citation Tessier, PSmil, DVWahhab, ALeit, SRahil, JLi, ZDéziel, RBesterman, JM Diphenylmethylene hydroxamic acids as selective class IIa histone deacetylase inhibitors. Bioorg Med Chem Lett19:5684-8 (2009) 
 
Histone deacetylase 7
Name:Histone deacetylase 7
Type:Chromatin regulator; hydrolase; repressor
Mol. Mass.:102942.62
Organism:Homo sapiens (Human)
Description:Q8WUI4
Residue:952
BDBM50300452
NameBDBM50300452
Synonyms:2,2-bis(4-chlorophenyl)-N-hydroxyacetamide | CHEMBL572805
TypeSmall organic molecule
Emp. Form.C14H11Cl2NO2
Mol. Mass.296.149
SMILESONC(=O)C(c1ccc(Cl)cc1)c1ccc(Cl)cc1