Reaction Details
TargetCannabinoid receptor 1
LigandBDBM50300457
Substrate/Competitorn/a
Meas. Tech.ChEMBL_592009 (CHEMBL1050124)
Ki 47±n/a nM
Citation Lange, JHden Hartog, APvan der Neut, MAvan Vliet, BJKruse, CG Synthesis and SAR of 1,4,5,6-tetrahydropyridazines as potent cannabinoid CB1 receptor antagonists. Bioorg Med Chem Lett19:5675-8 (2009) 
 
Cannabinoid receptor 1
Name:Cannabinoid receptor 1
Type:G Protein-Coupled Receptor (GPCR)
Mol. Mass.:52868.96
Organism:Homo sapiens (Human)
Description:P21554
Residue:472
BDBM50300457
NameBDBM50300457
Synonyms:3-(4-chlorophenyl)-N'-(4,4-difluoropiperidin-1-ylsulfonyl)-N-methyl-4-phenyl-5,6-dihydropyridazine-1(4H)-carboximidamide | CHEMBL574172
TypeSmall organic molecule
Emp. Form.C23H26ClF2N5O2S
Mol. Mass.510
SMILESCNC(=NS(=O)(=O)N1CCC(F)(F)CC1)N1CCC(C(=N1)c1ccc(Cl)cc1)c1ccccc1