Reaction Details
TargetCannabinoid receptor 2
LigandBDBM50300458
Substrate/Competitorn/a
Meas. Tech.ChEMBL_592011 (CHEMBL1050126)
Ki 219±n/a nM
Citation Lange, JHden Hartog, APvan der Neut, MAvan Vliet, BJKruse, CG Synthesis and SAR of 1,4,5,6-tetrahydropyridazines as potent cannabinoid CB1 receptor antagonists. Bioorg Med Chem Lett19:5675-8 (2009) 
 
Cannabinoid receptor 2
Name:Cannabinoid receptor 2
Type:G Protein-Coupled Receptor (GPCR)
Mol. Mass.:39690.94
Organism:Homo sapiens (Human)
Description:P34972
Residue:360
BDBM50300458
NameBDBM50300458
Synonyms:3-(4-chlorophenyl)-N'-(4,4-difluoropiperidin-1-ylsulfonyl)-N-methyl-4-phenyl-4,5-dihydro-1H-pyrazole-1-carboximidamide | CHEMBL578421
TypeSmall organic molecule
Emp. Form.C22H24ClF2N5O2S
Mol. Mass.495.973
SMILESCN=C(NS(=O)(=O)N1CCC(F)(F)CC1)N1CC(C(=N1)c1ccc(Cl)cc1)c1ccccc1