Reaction Details
TargetGenome polyprotein
LigandBDBM50300497
Substrate/Competitorn/a
Meas. Tech.ChEMBL_592497 (CHEMBL1043213)
IC50 3±n/a nM
Citation de Vicente, JHendricks, RTSmith, DBFell, JBFischer, JSpencer, SRStengel, PJMohr, PRobinson, JEBlake, JFHilgenkamp, RKYee, CAdjabeng, GElworthy, TRLi, JWang, BBamberg, JTHarris, SFWong, ALeveque, VJNajera, ILe Pogam, SRajyaguru, SAo-Ieong, GAlexandrova, LLarrabee, SBrandl, MBriggs, ASukhtankar, SFarrell, R Non-nucleoside inhibitors of HCV polymerase NS5B. Part 4: structure-based design, synthesis, and biological evaluation of benzo[d]isothiazole-1,1-dioxides. Bioorg Med Chem Lett19:5652-6 (2009) 
 
Genome polyprotein
Name:Genome polyprotein
Type:Enzyme
Mol. Mass.:326966.11
Organism:Hepatitis C virus (HCV)
Description:Q9WMX2
Residue:3010
BDBM50300497
NameBDBM50300497
Synonyms:CHEMBL578433 N-{3-[(S)-5-tert-Butyl-1-(4-fluoro-benzyl)-4-hydroxy-2-oxo-2,5-dihydro-1H-pyrrol-3-yl]-1,1-dioxo-1H-1lambda*6*-benzo[d]isothiazol-7-ylmethyl}-methanesulfonamide
TypeSmall organic molecule
Emp. Form.C24H26FN3O6S2
Mol. Mass.535.608
SMILESCC(C)(C)[C@@H]1N(Cc2ccc(F)cc2)C(=O)C(C1=O)=C1NS(=O)(=O)c2c1cccc2CNS(C)(=O)=O