Reaction Details
TargetGenome polyprotein
LigandBDBM50300503
Substrate/Competitorn/a
Meas. Tech.ChEMBL_592497 (CHEMBL1043213)
IC50 3±n/a nM
Citation de Vicente, JHendricks, RTSmith, DBFell, JBFischer, JSpencer, SRStengel, PJMohr, PRobinson, JEBlake, JFHilgenkamp, RKYee, CAdjabeng, GElworthy, TRLi, JWang, BBamberg, JTHarris, SFWong, ALeveque, VJNajera, ILe Pogam, SRajyaguru, SAo-Ieong, GAlexandrova, LLarrabee, SBrandl, MBriggs, ASukhtankar, SFarrell, R Non-nucleoside inhibitors of HCV polymerase NS5B. Part 4: structure-based design, synthesis, and biological evaluation of benzo[d]isothiazole-1,1-dioxides. Bioorg Med Chem Lett19:5652-6 (2009) 
 
Genome polyprotein
Name:Genome polyprotein
Type:Enzyme
Mol. Mass.:326966.11
Organism:Hepatitis C virus (HCV)
Description:Q9WMX2
Residue:3010
BDBM50300503
NameBDBM50300503
Synonyms:CHEMBL582995 | N-({3-[(5S)-5-tert-butyl-1-[(4-fluoro-3-methylphenyl)methyl]-4-hydroxy-2-oxo-2,5-dihydro-1H-pyrrol-3-yl]-1,1-dioxo-{6},2-benzothiazol-7-yl}methyl)aminosulfonamide
TypeSmall organic molecule
Emp. Form.C24H27FN4O6S2
Mol. Mass.550.623
SMILESCc1cc(CN2[C@H](C(=O)C(C3NS(=O)(=O)c4c3cccc4C=NS(N)(=O)=O)C2=O)C(C)(C)C)ccc1F