Reaction Details
TargetGenome polyprotein
LigandBDBM30491
Substrate/Competitorn/a
Meas. Tech.ChEMBL_592497 (CHEMBL1043213)
IC50 10±n/a nM
Citation de Vicente, JHendricks, RTSmith, DBFell, JBFischer, JSpencer, SRStengel, PJMohr, PRobinson, JEBlake, JFHilgenkamp, RKYee, CAdjabeng, GElworthy, TRLi, JWang, BBamberg, JTHarris, SFWong, ALeveque, VJNajera, ILe Pogam, SRajyaguru, SAo-Ieong, GAlexandrova, LLarrabee, SBrandl, MBriggs, ASukhtankar, SFarrell, R Non-nucleoside inhibitors of HCV polymerase NS5B. Part 4: structure-based design, synthesis, and biological evaluation of benzo[d]isothiazole-1,1-dioxides. Bioorg Med Chem Lett19:5652-6 (2009) 
 
Genome polyprotein
Name:Genome polyprotein
Type:Enzyme
Mol. Mass.:326966.11
Organism:Hepatitis C virus (HCV)
Description:Q9WMX2
Residue:3010
BDBM30491
NameBDBM30491
Synonyms:1,1-dioxoisothiazole analog., 35
TypeSmall organic molecule
Emp. Form.C25H27ClFN3O6S2
Mol. Mass.584.08
SMILESCN(Cc1cccc2C(NS(=O)(=O)c12)=C1C(=O)[C@@H](N(Cc2ccc(F)c(Cl)c2)C1=O)C(C)(C)C)S(C)(=O)=O