Reaction Details
TargetSodium-dependent serotonin transporter
LigandBDBM50300507
Substrate/Competitorn/a
Meas. Tech.ChEMBL_592525 (CHEMBL1044081)
IC50 14±n/a nM
Citation Mahaney, PEKim, CYCoghlan, RDCohn, STHeffernan, GDHuselton, CATerefenko, EAVu, ATZhang, PBurroughs, KDCosmi, SABray, JAJohnston, GHDeecher, DCTrybulski, EJ Structure-activity relationships of the 1-amino-3-(1H-indol-1-yl)-3-phenylpropan-2-ol series of monoamine reuptake inhibitors. Bioorg Med Chem Lett19:5807-10 (2009) 
 
Sodium-dependent serotonin transporter
Name:Sodium-dependent serotonin transporter
Type:Multi-pass membrane protein
Mol. Mass.:70322.51
Organism:Homo sapiens (Human)
Description:P31645
Residue:630
BDBM50300507
NameBDBM50300507
Synonyms:(R)-3-(3-fluorophenyl)-3-(1H-indol-1-yl)-N-methylpropan-1-amine | CHEMBL576542
TypeSmall organic molecule
Emp. Form.C18H19FN2
Mol. Mass.282.3553
SMILESCNCC[C@H](c1cccc(F)c1)n1ccc2ccccc12