Reaction Details
TargetSodium-dependent noradrenaline transporter
LigandBDBM50300525
Substrate/Competitorn/a
Meas. Tech.ChEMBL_592526 (CHEMBL1044082)
IC50 4±n/a nM
Citation Mahaney, PEKim, CYCoghlan, RDCohn, STHeffernan, GDHuselton, CATerefenko, EAVu, ATZhang, PBurroughs, KDCosmi, SABray, JAJohnston, GHDeecher, DCTrybulski, EJ Structure-activity relationships of the 1-amino-3-(1H-indol-1-yl)-3-phenylpropan-2-ol series of monoamine reuptake inhibitors. Bioorg Med Chem Lett19:5807-10 (2009) 
 
Sodium-dependent noradrenaline transporter
Name:Sodium-dependent noradrenaline transporter
Type:Multi-pass membrane protein
Mol. Mass.:69337.72
Organism:Homo sapiens (Human)
Description:P23975
Residue:617
BDBM50300525
NameBDBM50300525
Synonyms:(1S,2R)-1-(3-fluorophenyl)-1-(3-methyl-1H-indol-1-yl)-3-(methylamino)propan-2-ol | CHEMBL576145
TypeSmall organic molecule
Emp. Form.C19H21FN2O
Mol. Mass.312.3812
SMILESCNC[C@@H](O)[C@H](c1cccc(F)c1)n1cc(C)c2ccccc12