Reaction Details
TargetCytochrome P450 3A4
LigandBDBM50300538
Substrate/Competitorn/a
Meas. Tech.ChEMBL_588720 (CHEMBL1059329)
Ki 170±n/a nM
Citation McNulty, JNair, JJSingh, MCrankshaw, DJHolloway, AC Structure-activity studies on seco-pancratistatin analogs: potent inhibitors of human cytochrome P450 3A4. Bioorg Med Chem Lett19:5607-12 (2009) 
 
Cytochrome P450 3A4
Name:Cytochrome P450 3A4
Type:Enzyme
Mol. Mass.:57349.57
Organism:Homo sapiens (Human)
Description:n/a
Residue:503
BDBM50300538
NameBDBM50300538
Synonyms:CHEMBL574914 | N-((2R,3R)-2-(benzo[d][1,3]dioxol-5-yl)-3-((4S,5S)-5-((tert-butyldimethylsilyloxy)methyl)-2,2-dimethyl-1,3-dioxolan-4-yl)-3-hydroxypropyl)benzamide
TypeSmall organic molecule
Emp. Form.C29H41NO7Si
Mol. Mass.543.7238
SMILESCC(C)(C)[Si](C)(C)OC[C@@H]1OC(C)(C)O[C@H]1[C@H](O)[C@@H](CNC(=O)c1ccccc1)c1ccc2OCOc2c1