Reaction Details
TargetRas-related C3 botulinum toxin substrate 1
LigandBDBM50300548
Substrate/Competitorn/a
Meas. Tech.ChEMBL_588743 (CHEMBL1053690)
IC50 38000±n/a nM
Citation Beausoleil, EChauvignac, CTaverne, TLacombe, SPognante, LLeblond, BPallares, DOliveira, CDBachelot, FCarton, RPeillon, HCoutadeur, SPicard, VLambeng, NDésiré, LSchweighoffer, F Structure-activity relationship of isoform selective inhibitors of Rac1/1b GTPase nucleotide binding. Bioorg Med Chem Lett19:5594-8 (2009) 
 
Ras-related C3 botulinum toxin substrate 1
Name:Ras-related C3 botulinum toxin substrate 1
Type:PROTEIN
Mol. Mass.:21455.91
Organism:Homo sapiens (Human)
Description:ChEMBL_1337921
Residue:192
BDBM50300548
NameBDBM50300548
Synonyms:3,4,10,11-Tetrahydroxy-8-methyl-isoquino[3,2-a]isoquinolinylium chloride | CHEMBL573429
TypeSmall organic molecule
Emp. Form.C18H14NO4
Mol. Mass.308.3075
SMILESCc1c2cc(O)c(O)cc2cc2c3ccc(O)c(O)c3cc[n+]12