Reaction Details
TargetRas-related C3 botulinum toxin substrate 1
LigandBDBM50300554
Substrate/Competitorn/a
Meas. Tech.ChEMBL_588743 (CHEMBL1053690)
IC50 2700±n/a nM
Citation Beausoleil, EChauvignac, CTaverne, TLacombe, SPognante, LLeblond, BPallares, DOliveira, CDBachelot, FCarton, RPeillon, HCoutadeur, SPicard, VLambeng, NDésiré, LSchweighoffer, F Structure-activity relationship of isoform selective inhibitors of Rac1/1b GTPase nucleotide binding. Bioorg Med Chem Lett19:5594-8 (2009) 
 
Ras-related C3 botulinum toxin substrate 1
Name:Ras-related C3 botulinum toxin substrate 1
Type:PROTEIN
Mol. Mass.:21455.91
Organism:Homo sapiens (Human)
Description:ChEMBL_1337921
Residue:192
BDBM50300554
NameBDBM50300554
Synonyms:((2S,3R,4S,5S)-5-(2-amino-6-oxo-1H-purin-9(6H)-yl)-3,4-dihydroxytetrahydrofuran-2-yl)methyl hydrogen diphosphate | CHEMBL574200
TypeSmall organic molecule
Emp. Form.C10H15N5O11P2
Mol. Mass.443.2005
SMILESNc1nc2n(cnc2c(=O)[nH]1)[C@H]1O[C@@H](COP(O)(=O)OP(O)(O)=O)[C@H](O)[C@@H]1O