Reaction Details
TargetLiver carboxylesterase
LigandBDBM50300582
Substrate/Competitorn/a
Meas. Tech.ChEMBL_588965 (CHEMBL1056160)
Ki 156±n/a nM
Citation Makhaeva, GFAksinenko, AYSokolov, VBSerebryakova, OGRichardson, RJ Synthesis of organophosphates with fluorine-containing leaving groups as serine esterase inhibitors with potential for Alzheimer disease therapeutics. Bioorg Med Chem Lett19:5528-30 (2009) 
 
Liver carboxylesterase
Name:Liver carboxylesterase
Type:PROTEIN
Mol. Mass.:62009.98
Organism:Sus scrofa
Description:ChEMBL_427761
Residue:566
BDBM50300582
NameBDBM50300582
Synonyms:CHEMBL573979 | Dibutyl 2,2,2-trifluoro-1-phenylethyl phosphate
TypeSmall organic molecule
Emp. Form.C16H24F3O4P
Mol. Mass.368.3283
SMILESCCCCOP(=O)(OCCCC)OC(c1ccccc1)C(F)(F)F