Reaction Details
TargetPenicillin-binding protein 2x
LigandBDBM50300665
Substrate/Competitorn/a
Meas. Tech.ChEMBL_589009 (CHEMBL1055314)
IC50>1000000±n/a nM
Citation Inglis, SRZervosen, AWoon, ECGerards, TTeller, NFischer, DSLuxen, ASchofield, CJ Synthesis and evaluation of 3-(dihydroxyboryl)benzoic acids as D,D-carboxypeptidase R39 inhibitors. J Med Chem52:6097-106 (2009) 
 
Penicillin-binding protein 2x
Name:Penicillin-binding protein 2x
Type:PROTEIN
Mol. Mass.:82307.00
Organism:Streptococcus pneumoniae
Description:ChEMBL_653273
Residue:750
BDBM50300665
NameBDBM50300665
Synonyms:5-boronothiophene-2-carboxylic acid | CHEMBL573906
TypeSmall organic molecule
Emp. Form.C5H5BO4S
Mol. Mass.171.967
SMILESOB(O)c1ccc(s1)C(O)=O