Reaction Details
Target5-hydroxytryptamine receptor 6
LigandBDBM50300675
Substrate/Competitorn/a
Meas. Tech.ChEMBL_589223 (CHEMBL1041217)
Ki 1±n/a nM
Citation Mesquida, NLópez-Pérez, SDinarès, IFrigola, JMercè, RHolenz, JPérez, RBurgueño, JAlcalde, E Identification of novel indanylsulfonamide guanylhydrazones as potent 5-HT6 serotonin receptor antagonists. J Med Chem52:6153-7 (2009) 
 
5-hydroxytryptamine receptor 6
Name:5-hydroxytryptamine receptor 6
Type:G Protein-Coupled Receptor (GPCR)
Mol. Mass.:46968.43
Organism:Homo sapiens (Human)
Description:P50406
Residue:440
BDBM50300675
NameBDBM50300675
Synonyms:2-(1-(5-(phenylsulfonamido)-1H-indol-3-yl)ethylidene)hydrazinecarboximidamide | CHEMBL573982
TypeSmall organic molecule
Emp. Form.C17H18N6O2S
Mol. Mass.370.429
SMILESCC(=NN=C(N)N)c1c[nH]c2ccc(NS(=O)(=O)c3ccccc3)cc12