Reaction Details
TargetReceptor-type tyrosine-protein kinase FLT3
LigandBDBM50300704
Substrate/Competitorn/a
Meas. Tech.ChEMBL_589520 (CHEMBL1056849)
Kd 2±n/a nM
Citation Chao, QSprankle, KGGrotzfeld, RMLai, AGCarter, TAVelasco, AMGunawardane, RNCramer, MDGardner, MFJames, JZarrinkar, PPPatel, HKBhagwat, SS Identification of N-(5-tert-butyl-isoxazol-3-yl)-N'-{4-[7-(2-morpholin-4-yl-ethoxy)imidazo[2,1-b][1,3]benzothiazol-2-yl]phenyl}urea dihydrochloride (AC220), a uniquely potent, selective, and efficacious FMS-like tyrosine kinase-3 (FLT3) inhibitor. J Med Chem52:7808-16 (2009) 
 
Receptor-type tyrosine-protein kinase FLT3
Name:Receptor-type tyrosine-protein kinase FLT3
Type:Enzyme
Mol. Mass.:112888.62
Organism:Homo sapiens (Human)
Description:P36888
Residue:993
BDBM50300704
NameBDBM50300704
Synonyms:CHEMBL574576 | N-(5-tert-Butyl-isoxazol-3-yl)-N'-(4-{7-[3-(4-ethylpiperazin-1-yl)-3-oxopropyl]imidazo[2,1-b][1,3]benzothiazol-2-yl}phenyl)urea
TypeSmall organic molecule
Emp. Form.C32H37N7O3S
Mol. Mass.599.746
SMILESCCN1CCN(CC1)C(=O)CCc1ccc2c(c1)sc1nc(cn21)-c1ccc(NC(=O)Nc2cc(on2)C(C)(C)C)cc1