Reaction Details
TargetBeta-secretase 1
LigandBDBM50300710
Substrate/Competitorn/a
Meas. Tech.ChEMBL_589760 (CHEMBL1061264)
IC50 38000±n/a nM
Citation Malamas, MSErdei, JGunawan, IBarnes, KJohnson, MHui, YTurner, JHu, YWagner, EFan, KOlland, ABard, JRobichaud, AJ Aminoimidazoles as potent and selective human beta-secretase (BACE1) inhibitors. J Med Chem52:6314-23 (2009) 
 
Beta-secretase 1
Name:Beta-secretase 1
Type:Protein
Mol. Mass.:55755.10
Organism:Homo sapiens (Human)
Description:P56817
Residue:501
BDBM50300710
NameBDBM50300710
Synonyms:8,8-diphenyl-2,3,4,8-tetrahydroimidazo[1,5-a]pyrimidin-6-amine | CHEMBL582044
TypeSmall organic molecule
Emp. Form.C18H18N4
Mol. Mass.290.3623
SMILESNC1=NC(C2=NCCCN12)(c1ccccc1)c1ccccc1