Reaction Details
TargetCannabinoid receptor 1
LigandBDBM50202584
Substrate/Competitorn/a
Meas. Tech.ChEMBL_589971 (CHEMBL1050879)
Ki 6670±n/a nM
Citation Cano, CPáez, JAGoya, PSerrano, APavón, JRodríguez de Fonseca, FSuardíaz, MMartín, MI Synthesis and pharmacological evaluation of sulfamide-based analogues of anandamide. Eur J Med Chem44:4889-95 (2009) 
 
Cannabinoid receptor 1
Name:Cannabinoid receptor 1
Type:G Protein-Coupled Receptor (GPCR)
Mol. Mass.:52856.55
Organism:Rattus norvegicus (rat)
Description:P20272
Residue:473
BDBM50202584
NameBDBM50202584
Synonyms:CHEMBL218643 | N-(2-adamantyl)-N'-propylsulfamide
TypeSmall organic molecule
Emp. Form.C13H24N2O2S
Mol. Mass.272.407
SMILESCCCNS(=O)(=O)NC1C2CC3CC(C2)CC1C3