Reaction Details
TargetCathepsin B
LigandBDBM50258405
Substrate/Competitorn/a
Meas. Tech.ChEMBL_591547 (CHEMBL1062953)
IC50>50000±n/a nM
Citation Mallari, JPShelat, AAKosinski, ACaffrey, CRConnelly, MZhu, FMcKerrow, JHGuy, RK Structure-guided development of selective TbcatB inhibitors. J Med Chem52:6489-93 (2009) 
 
Cathepsin B
Name:Cathepsin B
Type:Enzyme
Mol. Mass.:37819.69
Organism:Homo sapiens (Human)
Description:gi_63102437
Residue:339
BDBM50258405
NameBDBM50258405
Synonyms:6-((3',4'-dichlorobiphenyl-3-yl)methylamino)-9-(3-hydroxypropyl)-9H-purine-2-carbonitrile | CHEMBL495017
TypeSmall organic molecule
Emp. Form.C22H18Cl2N6O
Mol. Mass.453.324
SMILESOCCCn1cnc2c(NCc3cccc(c3)-c3ccc(Cl)c(Cl)c3)nc(nc12)C#N