Reaction Details
TargetCysteine protease
LigandBDBM50268556
Substrate/Competitorn/a
Meas. Tech.ChEMBL_591545 (CHEMBL1062951)
IC50 800±n/a nM
Citation Mallari, JPShelat, AAKosinski, ACaffrey, CRConnelly, MZhu, FMcKerrow, JHGuy, RK Structure-guided development of selective TbcatB inhibitors. J Med Chem52:6489-93 (2009) 
 
Cysteine protease
Name:Cysteine protease
Synonyms:Rhodesain
Type:PROTEIN
Mol. Mass.:48425.78
Organism:Trypanosoma brucei rhodesiense
Description:ChEMBL_619861
Residue:450
BDBM50268556
NameBDBM50268556
TypeSmall organic molecule
Emp. Form.C20H18N6OS
Mol. Mass.390.462
SMILESOCCCn1cnc2c(NCc3cccc(c3)-c3cccs3)nc(nc12)C#N