Reaction Details
TargetProcathepsin L
LigandBDBM50258404
Substrate/Competitorn/a
Meas. Tech.ChEMBL_591546 (CHEMBL1062952)
IC50 900±n/a nM
Citation Mallari, JPShelat, AAKosinski, ACaffrey, CRConnelly, MZhu, FMcKerrow, JHGuy, RK Structure-guided development of selective TbcatB inhibitors. J Med Chem52:6489-93 (2009) 
 
Procathepsin L
Name:Procathepsin L
Type:Enzyme
Mol. Mass.:37557.19
Organism:Homo sapiens (Human)
Description:Purchased from Calbiochem (San Diego, CA).
Residue:333
BDBM50258404
NameBDBM50258404
Synonyms:6-((3',5'-dichlorobiphenyl-3-yl)methylamino)-9-(3-hydroxypropyl)-9H-purine-2-carbonitrile | CHEMBL495016
TypeSmall organic molecule
Emp. Form.C22H18Cl2N6O
Mol. Mass.453.324
SMILESOCCCn1cnc2c(NCc3cccc(c3)-c3cc(Cl)cc(Cl)c3)nc(nc12)C#N