Reaction Details
TargetCysteine protease
LigandBDBM50258404
Substrate/Competitorn/a
Meas. Tech.ChEMBL_591545 (CHEMBL1062951)
IC50 1100±n/a nM
Citation Mallari, JPShelat, AAKosinski, ACaffrey, CRConnelly, MZhu, FMcKerrow, JHGuy, RK Structure-guided development of selective TbcatB inhibitors. J Med Chem52:6489-93 (2009) 
 
Cysteine protease
Name:Cysteine protease
Synonyms:Rhodesain
Type:PROTEIN
Mol. Mass.:48425.78
Organism:Trypanosoma brucei rhodesiense
Description:ChEMBL_619861
Residue:450
BDBM50258404
NameBDBM50258404
TypeSmall organic molecule
Emp. Form.C22H18Cl2N6O
Mol. Mass.453.324
SMILESOCCCn1cnc2c(NCc3cccc(c3)-c3cc(Cl)cc(Cl)c3)nc(nc12)C#N