Reaction Details
TargetCysteine protease
LigandBDBM50300781
Substrate/Competitorn/a
Meas. Tech.ChEMBL_591545 (CHEMBL1062951)
IC50 1200±n/a nM
Citation Mallari, JPShelat, AAKosinski, ACaffrey, CRConnelly, MZhu, FMcKerrow, JHGuy, RK Structure-guided development of selective TbcatB inhibitors. J Med Chem52:6489-93 (2009) 
 
Cysteine protease
Name:Cysteine protease
Synonyms:Rhodesain
Type:PROTEIN
Mol. Mass.:48425.78
Organism:Trypanosoma brucei rhodesiense
Description:ChEMBL_619861
Residue:450
BDBM50300781
NameBDBM50300781
TypeSmall organic molecule
Emp. Form.C22H19ClN6O
Mol. Mass.418.879
SMILESOCCCn1cnc2c(NCc3cccc(c3)-c3cccc(Cl)c3)nc(nc12)C#N