Reaction Details
TargetCathepsin B
LigandBDBM50268556
Substrate/Competitorn/a
Meas. Tech.ChEMBL_591547 (CHEMBL1062953)
IC50 2500±n/a nM
Citation Mallari, JPShelat, AAKosinski, ACaffrey, CRConnelly, MZhu, FMcKerrow, JHGuy, RK Structure-guided development of selective TbcatB inhibitors. J Med Chem52:6489-93 (2009) 
 
Cathepsin B
Name:Cathepsin B
Type:Enzyme
Mol. Mass.:37819.69
Organism:Homo sapiens (Human)
Description:gi_63102437
Residue:339
BDBM50268556
NameBDBM50268556
Synonyms:9-(3-hydroxypropyl)-6-(3-(thiophen-2-yl)benzylamino)-9H-purine-2-carbonitrile | CHEMBL525165
TypeSmall organic molecule
Emp. Form.C20H18N6OS
Mol. Mass.390.462
SMILESOCCCn1cnc2c(NCc3cccc(c3)-c3cccs3)nc(nc12)C#N