Reaction Details
TargetNeuronal acetylcholine receptor subunit alpha-7
LigandBDBM50300802
Substrate/Competitorn/a
Meas. Tech.ChEMBL_598739 (CHEMBL1039309)
Ki 260±n/a nM
Citation Haydar, SNGhiron, CBettinetti, LBothmann, HComery, TADunlop, JLa Rosa, SMicco, IPollastrini, MQuinn, JRoncarati, RScali, CValacchi, MVarrone, MZanaletti, R SAR and biological evaluation of SEN12333/WAY-317538: Novel alpha 7 nicotinic acetylcholine receptor agonist. Bioorg Med Chem17:5247-58 (2009) 
 
Neuronal acetylcholine receptor subunit alpha-7
Name:Neuronal acetylcholine receptor subunit alpha-7
Type:Enzyme
Mol. Mass.:56502.44
Organism:Rattus norvegicus (Rat)
Description:Q05941
Residue:502
BDBM50300802
NameBDBM50300802
Synonyms:5-Morpholin-4-ylpentanoic acid(4-pyridin-3-ylphenyl)amide hydrochloride CHEMBL565540
TypeSmall organic molecule
Emp. Form.C20H25N3O2
Mol. Mass.339.4314
SMILESO=C(CCCCN1CCOCC1)Nc1ccc(cc1)-c1cccnc1