Reaction Details
Target5-hydroxytryptamine receptor 6
LigandBDBM50300838
Substrate/Competitorn/a
Meas. Tech.ChEMBL_598758 (CHEMBL1040173)
Ki 1±n/a nM
Citation Bernotas, RCLenicek, SAntane, SCole, DCHarrison, BLRobichaud, AJZhang, GMSmith, DPlatt, BLin, QLi, PCoupet, JRosenzweig-Lipson, SBeyer, CESchechter, LE Novel 1-aminoethyl-3-arylsulfonyl-1H-pyrrolo[2,3-b]pyridines are potent 5-HT(6) agonists. Bioorg Med Chem17:5153-63 (2009) 
 
5-hydroxytryptamine receptor 6
Name:5-hydroxytryptamine receptor 6
Type:G Protein-Coupled Receptor (GPCR)
Mol. Mass.:46968.43
Organism:Homo sapiens (Human)
Description:P50406
Residue:440
BDBM50300838
NameBDBM50300838
Synonyms:CHEMBL565552 | N,N-Dimethyl-N-{2-[3-(1-naphthylsulfonyl)-1Hpyrrolo[2,3-b]pyridin-1-yl]ethyl}amine
TypeSmall organic molecule
Emp. Form.C21H21N3O2S
Mol. Mass.379.475
SMILESCN(C)CCn1cc(c2cccnc12)S(=O)(=O)c1cccc2ccccc12