Reaction Details
TargetNuclear factor NF-kappa-B p105 subunit
LigandBDBM50300846
Substrate/Competitorn/a
Meas. Tech.ChEMBL_598993 (CHEMBL1041917)
IC50 28600±n/a nM
Citation Kobayashi, TYoshimori, AKino, KKomori, RMiyazawa, HTanuma, SI A new small molecule that directly inhibits the DNA binding of NF-kappaB. Bioorg Med Chem17:5293-7 (2009) 
 
Nuclear factor NF-kappa-B p105 subunit
Name:Nuclear factor NF-kappa-B p105 subunit
Type:Protein
Mol. Mass.:105329.57
Organism:Homo sapiens (Human)
Description:P19838
Residue:968
BDBM50300846
NameBDBM50300846
Synonyms:4,6-dichloro-N-phenyl-1,3,5-triazin-2-amine | CHEMBL576897
TypeSmall organic molecule
Emp. Form.C9H6Cl2N4
Mol. Mass.241.077
SMILESClc1nc(Cl)nc(Nc2ccccc2)n1