Reaction Details
TargetNuclear factor NF-kappa-B p105 subunit
LigandBDBM50300850
Substrate/Competitorn/a
Meas. Tech.ChEMBL_598993 (CHEMBL1041917)
IC50 110000±n/a nM
Citation Kobayashi, TYoshimori, AKino, KKomori, RMiyazawa, HTanuma, SI A new small molecule that directly inhibits the DNA binding of NF-kappaB. Bioorg Med Chem17:5293-7 (2009) 
 
Nuclear factor NF-kappa-B p105 subunit
Name:Nuclear factor NF-kappa-B p105 subunit
Type:Protein
Mol. Mass.:105329.57
Organism:Homo sapiens (Human)
Description:P19838
Residue:968
BDBM50300850
NameBDBM50300850
Synonyms:4,6-dichloro-N-(4-chlorophenyl)-1,3,5-triazin-2-amine | CHEMBL577302
TypeSmall organic molecule
Emp. Form.C9H5Cl3N4
Mol. Mass.275.522
SMILESClc1ccc(Nc2nc(Cl)nc(Cl)n2)cc1