Reaction Details
TargetMitogen-activated protein kinase 14
LigandBDBM50229971
Substrate/Competitorn/a
Meas. Tech.ChEMBL_599898 (CHEMBL1045463)
IC50 12000±n/a nM
Citation Peifer, CAbadleh, MBischof, JHauser, DSchattel, VHirner, HKnippschild, ULaufer, S 3,4-Diaryl-isoxazoles and -imidazoles as potent dual inhibitors of p38alpha mitogen activated protein kinase and casein kinase 1delta. J Med Chem52:7618-30 (2009) 
 
Mitogen-activated protein kinase 14
Name:Mitogen-activated protein kinase 14
Type:Serine/threonine-protein kinase
Mol. Mass.:41286.76
Organism:Homo sapiens (Human)
Description:Q16539
Residue:360
BDBM50229971
NameBDBM50229971
Synonyms:4-(4-(2,3-Dihydrobenzo[1,4]dioxin-6-yl)-5-pyridin-2-yl-1H-imidazol-2-yl)benzamide 4-[4-(2,3-dihydro-benzo[1,4]dioxin-6-yl)-5-pyridin-2-yl-1H-imidazol-2-yl]benzamide | CHEMBL410456
TypeSmall organic molecule
Emp. Form.C23H18N4O3
Mol. Mass.398.414
SMILESNC(=O)c1ccc(cc1)-c1nc(c([nH]1)-c1ccc2OCCOc2c1)-c1ccccn1