Reaction Details
TargetMitogen-activated protein kinase 14
LigandBDBM50300887
Substrate/Competitorn/a
Meas. Tech.ChEMBL_599883 (CHEMBL1045448)
IC50 450±n/a nM
Citation Peifer, CAbadleh, MBischof, JHauser, DSchattel, VHirner, HKnippschild, ULaufer, S 3,4-Diaryl-isoxazoles and -imidazoles as potent dual inhibitors of p38alpha mitogen activated protein kinase and casein kinase 1delta. J Med Chem52:7618-30 (2009) 
 
Mitogen-activated protein kinase 14
Name:Mitogen-activated protein kinase 14
Type:Serine/threonine-protein kinase
Mol. Mass.:41286.76
Organism:Homo sapiens (Human)
Description:Q16539
Residue:360
BDBM50300887
NameBDBM50300887
Synonyms:(R)-4-(3-(4-fluorophenyl)-5-isopropylisoxazol-4-yl)-N-(1-phenylethyl)pyridin-2-amine | CHEMBL571356
TypeSmall organic molecule
Emp. Form.C25H24FN3O
Mol. Mass.401.476
SMILESCC(C)c1onc(c1-c1ccnc(N[C@H](C)c2ccccc2)c1)-c1ccc(F)cc1