Reaction Details
TargetMitogen-activated protein kinase 14
LigandBDBM50300891
Substrate/Competitorn/a
Meas. Tech.ChEMBL_599883 (CHEMBL1045448)
IC50 890±n/a nM
Citation Peifer, CAbadleh, MBischof, JHauser, DSchattel, VHirner, HKnippschild, ULaufer, S 3,4-Diaryl-isoxazoles and -imidazoles as potent dual inhibitors of p38alpha mitogen activated protein kinase and casein kinase 1delta. J Med Chem52:7618-30 (2009) 
 
Mitogen-activated protein kinase 14
Name:Mitogen-activated protein kinase 14
Type:Serine/threonine-protein kinase
Mol. Mass.:41286.76
Organism:Homo sapiens (Human)
Description:Q16539
Residue:360
BDBM50300891
NameBDBM50300891
Synonyms:(rac)-N-(4-(3-(4-fluorophenyl)-5-isopropylisoxazol-4-yl)pyridin-2-yl)-2-phenoxypropanamide | CHEMBL566058
TypeSmall organic molecule
Emp. Form.C26H24FN3O3
Mol. Mass.445.4855
SMILESCC(C)c1onc(c1-c1ccnc(NC(=O)C(C)Oc2ccccc2)c1)-c1ccc(F)cc1