Reaction Details
TargetCasein kinase I isoform delta
LigandBDBM50300888
Substrate/Competitorn/a
Meas. Tech.ChEMBL_599890 (CHEMBL1045455)
IC50 1600±n/a nM
Citation Peifer, CAbadleh, MBischof, JHauser, DSchattel, VHirner, HKnippschild, ULaufer, S 3,4-Diaryl-isoxazoles and -imidazoles as potent dual inhibitors of p38alpha mitogen activated protein kinase and casein kinase 1delta. J Med Chem52:7618-30 (2009) 
 
Casein kinase I isoform delta
Name:Casein kinase I isoform delta
Type:Enzyme
Mol. Mass.:47356.76
Organism:Homo sapiens (Human)
Description:P48730
Residue:415
BDBM50300888
NameBDBM50300888
Synonyms:(S)-4-(3-(4-fluorophenyl)-5-isopropylisoxazol-4-yl)-N-(1-phenylethyl)pyridin-2-amine | CHEMBL571357
TypeSmall organic molecule
Emp. Form.C25H24FN3O
Mol. Mass.401.476
SMILESCC(C)c1onc(c1-c1ccnc(N[C@@H](C)c2ccccc2)c1)-c1ccc(F)cc1