Reaction Details
TargetCasein kinase I isoform delta
LigandBDBM50300889
Substrate/Competitorn/a
Meas. Tech.ChEMBL_599899 (CHEMBL1045464)
IC50 330±n/a nM
Citation Peifer, CAbadleh, MBischof, JHauser, DSchattel, VHirner, HKnippschild, ULaufer, S 3,4-Diaryl-isoxazoles and -imidazoles as potent dual inhibitors of p38alpha mitogen activated protein kinase and casein kinase 1delta. J Med Chem52:7618-30 (2009) 
 
Casein kinase I isoform delta
Name:Casein kinase I isoform delta
Type:Enzyme
Mol. Mass.:47342.73
Organism:Rattus norvegicus (rat)
Description:Q06486
Residue:415
BDBM50300889
NameBDBM50300889
Synonyms:CHEMBL585533 | N-(4-(3-(4-fluorophenyl)-5-isopropylisoxazol-4-yl)pyridin-2-yl)acetamide
TypeSmall organic molecule
Emp. Form.C19H18FN3O2
Mol. Mass.339.3635
SMILESCC(C)c1onc(c1-c1ccnc(NC(C)=O)c1)-c1ccc(F)cc1